{"text_format":"1","workbook":"xlsx","n_sheets":17,"sheets":["Question bank","Parameters","Driver Summary","Main","Resources","Evaluation","Value Chain","Biosecurity","Market","Cost","Climate","Downstream processing","Product differentiation","Improving productivity","Financial resilience","Building networks","Diversification"],"not_rendered":{"charts":17,"images":18,"macros":1,"external_links":0,"defined_names":17,"comments":0,"pivot_tables":0},"unopened":[],"bounds":{"document_bytes":16777216,"sheet_cells":100000,"rows_first":2000,"rows_last":500,"rows_between":2000,"halvings":0,"cell_chars":16384,"cell_head_chars":4096},"cells_cut":0,"cells_raw":0,"read":"whole","date_system":"1900"}

{"sheet":"Question bank","index":0,"n_rows":49,"n_cols":15,"rows_kept":49,"cut":false,"hidden":true,"merged":[]}
["Category","Title","Question","Rating","Score","Adjustment factor","Justfication","Adjusted score"]
["Driver","Market","Prices are highly variable for my produce.",{"$f":"Market!U10","v":0},{"$f":"VLOOKUP(D2,Parameters!$B$3:$C$9,2,FALSE)","v":{"$error":"#N/A"}},1,null,{"$f":"E2*F2","v":{"$error":"#N/A"}},null,null,"Normalised score refers to "]
["Driver","Market","A change in prices has had a big impact on my revenues in the past.",{"$f":"Market!U15","v":0},{"$f":"VLOOKUP(D3,Parameters!$B$3:$C$9,2,FALSE)","v":{"$error":"#N/A"}},1,null,{"$f":"E3*F3","v":{"$error":"#N/A"}}]
["Driver","Market","I am able to quickly respond to changes in prices by changing production capacity or product mix. ",{"$f":"Market!U20","v":0},{"$f":"VLOOKUP(D4,Parameters!$B$3:$C$9,2,FALSE)","v":{"$error":"#N/A"}},-1,null,{"$error":"#N/A"},null,null,"Guide for Drivers",null,null,null,"Guide for Strategies"]
["Driver","Market","I anticipate an increase in demand for my produce in the near future and I am well-positioned to respond. ",{"$f":"Market!U25","v":0},{"$f":"VLOOKUP(D5,Parameters!$B$3:$C$9,2,FALSE)","v":{"$error":"#N/A"}},-1,null,{"$error":"#N/A"},null,null,"High numbers = high vulnerability",null,null,null,"High numbers = well versed in the strategy"]
["Driver","Costs","My costs of production are likely to vary significantly year-to-year. ",{"$f":"Cost!U10","v":0},{"$f":"VLOOKUP(D6,Parameters!$B$3:$C$9,2,FALSE)","v":{"$error":"#N/A"}},1,null,{"$error":"#N/A"},null,3,"Low numbers = little impact ",null,null,null,"Low numbers = capacity to implement"]
["Driver","Costs","In the past, these changes in costs of production have had a big impact on my profitability.",{"$f":"Cost!U15","v":0},{"$f":"VLOOKUP(D7,Parameters!$B$3:$C$9,2,FALSE)","v":{"$error":"#N/A"}},1,null,{"$error":"#N/A"},null,{"$f":"J6/4","v":0.75}]
["Driver","Costs","I actively search for ways to minimise costs to control for them in the long-term. ",{"$f":"Cost!U20","v":0},{"$f":"VLOOKUP(D8,Parameters!$B$3:$C$9,2,FALSE)","v":{"$error":"#N/A"}},-1,null,{"$error":"#N/A"},null,null,"21  Driver questions ",null,null,null,"26 Driver questions"]
["Driver","Costs","I am able to adequately manage variability in costs e.g., chemicals and fertiliser, labour, seeds, other input costs, etc. ",{"$f":"Cost!U25","v":0},{"$f":"VLOOKUP(D9,Parameters!$B$3:$C$9,2,FALSE)","v":{"$error":"#N/A"}},-1,null,{"$error":"#N/A"},null,null,"Max score for each question ranges from 0 to 3."]
["Driver","Supply and value chain","I have ready access to value-adding processing options.",{"$f":"'Value Chain'!U10","v":0},{"$f":"VLOOKUP(D10,Parameters!$B$3:$C$9,2,FALSE)","v":{"$error":"#N/A"}},-1,null,{"$error":"#N/A"},null,null,"Max score for a driver is 16 "]
["Driver","Supply and value chain","I have ready access to my target market/s. ",{"$f":"'Value Chain'!U15","v":0},{"$f":"VLOOKUP(D11,Parameters!$B$3:$C$9,2,FALSE)","v":{"$error":"#N/A"}},-1,null,{"$error":"#N/A"}]
["Driver","Supply and value chain","It is easy for me to access/utilise the natural resources (e.g., water, native vegetation) needed for production. ",{"$f":"'Value Chain'!U20","v":0},{"$f":"VLOOKUP(D12,Parameters!$B$3:$C$9,2,FALSE)","v":{"$error":"#N/A"}},-1,null,{"$error":"#N/A"}]
["Driver","Supply and value chain","I have timely access to the inputs (e.g., chemicals, fertilisers) needed for production.",{"$f":"'Value Chain'!U25","v":0},{"$f":"VLOOKUP(D13,Parameters!$B$3:$C$9,2,FALSE)","v":{"$error":"#N/A"}},-1,null,{"$error":"#N/A"}]
["Driver","Biosecurity","My industry has an effective biosecurity management plan. ",{"$f":"Biosecurity!U10","v":0},{"$f":"VLOOKUP(D14,Parameters!$B$3:$C$9,2,FALSE)","v":{"$error":"#N/A"}},-1,null,{"$error":"#N/A"}]
["Driver","Biosecurity","I have an effective biosecurity management plan. ",{"$f":"Biosecurity!U15","v":0},{"$f":"VLOOKUP(D15,Parameters!$B$3:$C$9,2,FALSE)","v":{"$error":"#N/A"}},-1,null,{"$error":"#N/A"}]
{"$rows_left_out":35}
{"sheet":"Parameters","index":1,"n_rows":47,"n_cols":24,"rows_kept":47,"cut":false,"hidden":true,"merged":[]}
[]
[null,"Likert scale answers","Rating",null,null,"Driver-Strategy pairings",null,null,null,null,null,null,null,null,null,"Enterprise selection matrix"]
[null,"Strongly Disagree",-3,null,null,"Pairing 1","Pairing 2","Pairing 3","Pairing 4","Pairing 5",null,null,null,null,null,{"$f":"F13","v":"Supply and value chain"},{"$f":"F14","v":"Biosecurity"},"Output 1",{"$f":"F15","v":"Market"},"Output 2"]
[null,"Disagree",-2,null,null,"Market","Climate","Costs","Biosecurity","Supply and value chain",null,null,null,null,null,{"$f":"HLOOKUP(P$3,$F$4:$J$8,2,FALSE)","v":"Downstream processing"},{"$f":"HLOOKUP(Q$3,$F$4:$J$8,2,FALSE)","v":"Diversification"},{"$f":"_xlfn._xlws.FILTER(P4:P9,COUNTIF(Q4:Q9,P4:P9))","v":"Financial resilience"},{"$f":"HLOOKUP(S$3,$F$4:$J$8,2,FALSE)","v":"Product differentiation"},{"$f":"_xlfn._xlws.FILTER(R4:R9,COUNTIF(S4:S9,R4:R9))","v":"Financial resilience"}]
[null,"Slightly Disagree",-1,null,null,"Product differentiation","Product differentiation","Improve productivity","Diversification","Downstream processing",null,null,null,null,null,{"$f":"HLOOKUP(P$3,$F$4:$J$8,3,FALSE)","v":"Financial resilience"},{"$f":"HLOOKUP(Q$3,$F$4:$J$8,3,FALSE)","v":"Building networks"},"Building networks",{"$f":"HLOOKUP(S$3,$F$4:$J$8,3,FALSE)","v":"Diversification"},"Building networks"]
[null,"Neither agree nor disagree",0,null,null,"Diversification","Diversification","Financial resilience","Building networks","Financial resilience",null,null,null,null,null,{"$f":"HLOOKUP(P$3,$F$4:$J$8,4,FALSE)","v":"Building networks"},{"$f":"HLOOKUP(Q$3,$F$4:$J$8,4,FALSE)","v":"Financial resilience"},"Diversification",{"$f":"HLOOKUP(S$3,$F$4:$J$8,4,FALSE)","v":"Financial resilience"},"Diversification"]
[null,"Slightly Agree",1,null,null,"Financial resilience","Improve productivity","Building networks","Financial resilience","Building networks",null,null,null,null,null,{"$f":"HLOOKUP(P$3,$F$4:$J$8,5,FALSE)","v":"Diversification"},{"$f":"HLOOKUP(Q$3,$F$4:$J$8,5,FALSE)","v":0},0,{"$f":"HLOOKUP(S$3,$F$4:$J$8,5,FALSE)","v":"Building networks"}]
[null,"Agree",2,null,null,"Building networks","Financial resilience",null,null,"Diversification",null,null,null,null,null,null,null,0]
[null,"Strongly Agree",3]
[]
[null,1,{"$f":"VLOOKUP(B11,$E$13:$F$17,2,FALSE)","v":{"$error":"#N/A"}},null,null,"Driver rating"]
[null,2,{"$f":"VLOOKUP(B12,$E$13:$F$17,2,FALSE)","v":{"$error":"#N/A"}},null,null,"Driver","Score","Number of questions","High","Very High","Number of questions2","Rank","Tie","Tie2",null,null,null,"Total risk score","Risk level",null,"Total strategy rating","Risk level",null,"Text for resources page"]
[null,3,{"$error":"#N/A"},null,{"$f":"Table5[[#This Row],[Tie2]]","v":{"$error":"#N/A"}},"Supply and value chain",{"$f":"SUMIFS(Table1[Adjusted score],Table1[Title],F13)/4*4/Table5[[#This Row],[Number of questions]]","v":{"$error":"#N/A"}},{"$f":"COUNTIF(Table1[Title],\"Supply and value chain\")","v":4},11,16,4,{"$f":"_xlfn.RANK.EQ(G13,$G$13:$G$17,0)","v":{"$error":"#N/A"}},{"$f":"IF(COUNTIF($L$13:Table5[[#This Row],[Rank]],Table5[[#This Row],[Rank]])>1,Table5[[#This Row],[Rank]]+1,Table5[[#This Row],[Rank]])","v":{"$error":"#N/A"}},{"$f":"IF(COUNTIF($M$13:Table5[[#This Row],[Tie]],Table5[[#This Row],[Tie]])>1,Table5[[#This Row],[Tie]]+1,Table5[[#This Row],[Tie]])","v":{"$error":"#N/A"}},null,null,null,null,null,{"$f":"21/4","v":5.25},1,"room for improvement",{"$f":"H34/4","v":4.5},"This page contains a list of information and resources made available online. These resources will contain information that might be useful for your enterprise. "]
[null,null,null,null,{"$f":"Table5[[#This Row],[Tie2]]","v":{"$error":"#N/A"}},"Biosecurity",{"$f":"SUMIFS(Table1[Adjusted score],Table1[Title],F14)/4*4/Table5[[#This Row],[Number of questions]]","v":{"$error":"#N/A"}},{"$f":"COUNTIF(Table1[Title],\"Biosecurity\")","v":5},11,16,5,{"$f":"_xlfn.RANK.EQ(G14,$G$13:$G$17,0)","v":{"$error":"#N/A"}},{"$f":"IF(COUNTIF($L$13:Table5[[#This Row],[Rank]],Table5[[#This Row],[Rank]])>1,Table5[[#This Row],[Rank]]+1,Table5[[#This Row],[Rank]])","v":{"$error":"#N/A"}},{"$f":"IF(COUNTIF($M$13:Table5[[#This Row],[Tie]],Table5[[#This Row],[Tie]])>1,Table5[[#This Row],[Tie]]+1,Table5[[#This Row],[Tie]])","v":{"$error":"#N/A"}},null,null,null,0,"low",null,2,"room for improvement",null,"The resources provided in this page are gathered from a range of publications and industries. You might be given a recommendation to a source that may have been originally catered to a different industry to yours because we believe that there are still valueable lessons and insights that can be drawn from this information. This is not an exhaustive list of information, but it is meant to act as a starting point to for producers to understand the drivers that they are vulnerable to and what options they can explore to build their robustness. "]
[null,null,null,null,{"$f":"Table5[[#This Row],[Tie2]]","v":{"$error":"#N/A"}},"Market",{"$f":"SUMIFS(Table1[Adjusted score],Table1[Title],F15)/4*4/Table5[[#This Row],[Number of questions]]","v":{"$error":"#N/A"}},{"$f":"COUNTIF(Table1[Title],\"Market\")","v":4},11,16,4,{"$f":"_xlfn.RANK.EQ(G15,$G$13:$G$17,0)","v":{"$error":"#N/A"}},{"$f":"IF(COUNTIF($L$13:Table5[[#This Row],[Rank]],Table5[[#This Row],[Rank]])>1,Table5[[#This Row],[Rank]]+1,Table5[[#This Row],[Rank]])","v":{"$error":"#N/A"}},{"$f":"IF(COUNTIF($M$13:Table5[[#This Row],[Tie]],Table5[[#This Row],[Tie]])>1,Table5[[#This Row],[Tie]]+1,Table5[[#This Row],[Tie]])","v":{"$error":"#N/A"}},null,null,null,1,"low",null,3,"room for improvement",null,"Based on how you have answered the questions on the drivers, the strategies that you are recommended to look further into are:"]
{"$rows_left_out":33}
{"sheet":"Driver Summary","index":2,"n_rows":31,"n_cols":14,"rows_kept":31,"cut":false,"hidden":true,"merged":[[2,2,4,20],[30,2,32,18],[10,13,28,20],[7,13,9,20]]}
[]
[]
[null,null,"Summary -  Drivers"]
[]
[]
[null,null,"This page shows you your relative risk rating for the five different drivers. "]
[]
[null,null,null,null,null,null,null,null,null,null,null,null,null,"Summary analysis on your enterprise's sensitivity to external drivers"]
[]
[]
[null,null,null,null,null,null,null,null,null,null,null,null,null,{"$f":"\"The chart on the left shows the additional contribution of each external driver to your overall risk exposure, and the diagram on the right shows that\"&\" your overall risk level is rated at \"&ROUNDUP(Parameters!G20,0)&\", indicating that your risk level is considered \"&IF(Parameters!G20>0,(VLOOKUP(ROUNDUP(Parameters!G20,0),Parameters!R14:S34,2,FALSE)),\"low\")&\". \"&CHAR(10)&CHAR(10)& _xlfn.CONCAT(Parameters!P40)&CHAR(10)&CHAR(10)&_xlfn.CONCAT(Parameters!P41)&CHAR(10)&CHAR(10)&\"The three drivers that you are relatively more exposed to as potential bust factors are \"&Parameters!C11&\", \"&Parameters!C12&\", and \"&Parameters!C13&\".\"&CHAR(10)&CHAR(10)","v":{"$error":"#N/A"}}]
[]
[]
[]
[]
{"$rows_left_out":17}
{"sheet":"Main","index":3,"n_rows":76,"n_cols":4,"rows_kept":76,"cut":false,"hidden":false,"merged":[[2,3,4,21],[6,3,56,21],[65,3,71,21],[75,3,78,21]]}
[]
[]
[null,null,null,"Vulnerability and Opportunities Self-Assessment Tool"]
[]
[]
[]
[null,null,null,"Our project aims to provide primary producers with a self-assessment tool to help them understand, at a high level, their strengths and weaknesses, their vulnerabilities to risk, and their capacity to take advantage of opportunities as they present themselves. \n\nThis self-assessment questionnaire will cover 2 main themes and is split into two halves:\n- The degree of exposure to 5 external drivers (Market, Cost, Climate, Biosecurity, and Value Chain).\n- The viability of strategies that can be undertaken to navigate your enterprise through these drivers. \n\nPrior to using the tool, you will need to click on \"enable content\" above.\n\n\n\n\n\nThis questionnaire will be set up as a series of Likert scale questions to assess the level of agreeableness to a series of statements. As you progress through the tool, you will be asked to select 1 of these 7 responses from the box to the right of the question. You will only be allowed to progress if you have answered all of the statements on the page. \n\n\n\n\n\n\n\n\n\n\n\n\n\nClick on the Start button above to begin the self-assessment tool. \n\nThis self-assessment tool is intenteded to be used in conjuction with the Boom and Bust Planning Guide which is currently in development. The guide will contain supplementary information for this tool."]
[]
[]
[]
[]
[]
[]
[]
[]
{"$rows_left_out":62}
{"sheet":"Resources","index":4,"n_rows":117,"n_cols":14,"rows_kept":117,"cut":false,"hidden":true,"merged":[[3,2,4,14]]}
[]
[]
[null,null,"Resources"]
[null,null,{"$f":"_xlfn.CONCAT(Parameters!X13,Parameters!X14,CHAR(10),CHAR(10),CHAR(10),Parameters!X16)","v":"This page contains a list of information and resources made available online. These resources will contain information that might be useful for your enterprise. The resources provided in this page are gathered from a range of publications and industries. You might be given a recommendation to a source that may have been originally catered to a different industry to yours because we believe that there are still valueable lessons and insights that can be drawn from this information. This is not an exhaustive list of information, but it is meant to act as a starting point to for producers to understand the drivers that they are vulnerable to and what options they can explore to build their robustness. \n\n\nBased on how you have answered the questions on the strategies, you are recommended to look further into:"}]
[]
[null,null,{"$f":"_xlfn.CONCAT(\"i) \",Parameters!C27)","v":{"$error":"#N/A"}}]
[null,null,{"$f":"_xlfn.CONCAT(\"ii) \", Parameters!C28)","v":{"$error":"#N/A"}}]
[]
[]
[]
[]
[]
[]
[]
[]
{"$rows_left_out":103}
{"sheet":"Evaluation","index":5,"n_rows":40,"n_cols":31,"rows_kept":40,"cut":false,"hidden":true,"merged":[[2,3,4,21],[30,3,32,19],[5,3,5,21],[10,14,28,21],[7,14,9,21]]}
[]
[]
[null,null,null,"Summary -  Strategies"]
[]
[]
[null,null,null,"This page shows you the relative rating of the 6 strategies. The further out the lines are, the more well versed you are in the strategy. The lower the score is the less experienced you are in the strategy. "]
[]
[null,null,null,null,null,null,null,null,null,null,null,null,null,null,"Summary analysis on your enterprise's capacity to implement strategies"]
[]
[]
[null,null,null,null,null,null,null,null,null,null,null,null,null,null,{"$f":"\"The chart on the left shows the rating for each strategy, and the diagram shows that\"&\" your total strategy rating is scored at \"&ROUNDUP(Parameters!G34,0)&\", indicating that your enterprise's capacity to implement strategies is considered to have \"&IF(Parameters!G34>0,(VLOOKUP(ROUNDUP(Parameters!G34,0),Parameters!U13:V36,2)),\"room for improvement\")&\". \"&CHAR(10)&CHAR(10)&_xlfn.CONCAT(Parameters!P42)&CHAR(10)&CHAR(10)&\"The three strategies that you are relatively more well versed in are \"&Parameters!C22&\", \"&Parameters!C23&\", and \"&Parameters!C24&\".\"&CHAR(10)&CHAR(10)","v":{"$error":"#N/A"}}]
[]
[]
[]
[]
{"$rows_left_out":26}
{"sheet":"Value Chain","index":6,"n_rows":25,"n_cols":5,"rows_kept":25,"cut":false,"hidden":true,"merged":[[19,3,21,3],[19,4,21,19],[19,20,21,21],[24,3,26,3],[24,4,26,19],[24,20,26,21],[2,3,4,21],[9,3,11,3],[9,4,11,19],[9,20,11,21],[14,3,16,3],[14,4,16,19],[14,20,16,21]]}
[]
[]
[null,null,null,"Value Chain"]
[]
[]
[null,null,null,"This refers to domestic processing capabilities, issues with transport and logistics, "]
[null,null,null,"accessibility of key inputs, and access to natural resources."]
[]
[]
[null,null,null,1,{"$f":"'Question bank'!C10","v":"I have ready access to value-adding processing options."}]
[]
[]
[]
[]
[null,null,null,2,{"$f":"'Question bank'!C11","v":"I have ready access to my target market/s. "}]
{"$rows_left_out":11}
{"sheet":"Biosecurity","index":7,"n_rows":30,"n_cols":5,"rows_kept":30,"cut":false,"hidden":true,"merged":[[29,3,31,3],[29,4,31,19],[29,20,31,21],[2,3,4,21],[9,3,11,3],[9,4,11,19],[9,20,11,21],[14,3,16,3],[14,4,16,19],[14,20,16,21],[19,3,21,3],[19,4,21,19],[19,20,21,21],[24,3,26,3],[24,4,26,19],[24,20,26,21]]}
[]
[]
[null,null,null,"Biosecurity"]
[]
[]
[null,null,null,"This refers to pests, weeds, disease, and how they might affect market access and operations."]
[]
[]
[]
[null,null,null,1,{"$f":"'Question bank'!C14","v":"My industry has an effective biosecurity management plan. "}]
[]
[]
[]
[]
[null,null,null,2,{"$f":"'Question bank'!C15","v":"I have an effective biosecurity management plan. "}]
{"$rows_left_out":16}
{"sheet":"Market","index":8,"n_rows":25,"n_cols":5,"rows_kept":25,"cut":false,"hidden":true,"merged":[[2,3,4,21],[24,4,26,19],[24,3,26,3],[24,20,26,21],[19,20,21,21],[14,20,16,21],[9,20,11,21],[9,4,11,19],[14,4,16,19],[19,4,21,19],[19,3,21,3],[14,3,16,3],[9,3,11,3]]}
[]
[]
[null,null,null,"Market"]
[]
[]
[null,null,null,"This refers to considerations such as market access and demand, prices that you receive for your product, "]
[null,null,null,"the level of competition,  consumer preferenecs, and a social license to operate."]
[]
[]
[null,null,null,1,{"$f":"'Question bank'!C2","v":"Prices are highly variable for my produce."}]
[]
[]
[]
[]
[null,null,null,2,{"$f":"'Question bank'!C3","v":"A change in prices has had a big impact on my revenues in the past."}]
{"$rows_left_out":11}
{"sheet":"Cost","index":9,"n_rows":25,"n_cols":5,"rows_kept":25,"cut":false,"hidden":true,"merged":[[19,3,21,3],[19,4,21,19],[19,20,21,21],[24,3,26,3],[24,4,26,19],[24,20,26,21],[2,3,4,21],[9,3,11,3],[9,4,11,19],[9,20,11,21],[14,3,16,3],[14,4,16,19],[14,20,16,21]]}
[]
[]
[null,null,null,"Cost"]
[]
[]
[null,null,null,"These refer to costs such as energy/fuel, water and irrigation, fertiliser/chemicals, financing, "]
[null,null,null,"capital and plant and equipment expenditure."]
[]
[]
[null,null,null,1,{"$f":"'Question bank'!C6","v":"My costs of production are likely to vary significantly year-to-year. "}]
[]
[]
[]
[]
[null,null,null,2,{"$f":"'Question bank'!C7","v":"In the past, these changes in costs of production have had a big impact on my profitability."}]
{"$rows_left_out":11}
{"sheet":"Climate","index":10,"n_rows":25,"n_cols":5,"rows_kept":25,"cut":false,"hidden":true,"merged":[[19,3,21,3],[19,4,21,19],[19,20,21,21],[24,3,26,3],[24,4,26,19],[24,20,26,21],[2,3,4,21],[9,3,11,3],[9,4,11,19],[9,20,11,21],[14,3,16,3],[14,4,16,19],[14,20,16,21]]}
[]
[]
[null,null,null,"Climate"]
[]
[]
[null,null,null,"This refers to considerations such as drought, floods, rainfall, heatwaves, frost/hail, and bushfires."]
[]
[]
[]
[null,null,null,1,{"$f":"'Question bank'!C19","v":"My enterprise performance is negatively impacted by extreme weather events and climate variability."}]
[]
[]
[]
[]
[null,null,null,2,{"$f":"'Question bank'!C20","v":"There is a high or increasing likelihood of exposure to extreme weather events (e.g., drought, floods, heatwaves, bushfire) in the region/s where I farm."}]
{"$rows_left_out":11}
{"sheet":"Downstream processing","index":11,"n_rows":25,"n_cols":5,"rows_kept":25,"cut":false,"hidden":true,"merged":[[19,3,21,3],[19,4,21,19],[19,20,21,21],[24,3,26,3],[24,4,26,19],[24,20,26,21],[2,3,4,21],[9,3,11,3],[9,4,11,19],[9,20,11,21],[14,3,16,3],[14,4,16,19],[14,20,16,21]]}
[]
[]
[null,null,null,"Downstream processing"]
[]
[]
[null,null,null,"This refers to processing and packaging capabilities, and whether there currently is (or will be) "]
[null,null,null,"sufficient investment in plants and equipment. Logistical capabilities are also considered. "]
[]
[]
[null,null,null,1,{"$f":"'Question bank'!C28","v":"I am able to send my products downstream for processing, packaging, or value-adding/enhancing my product."}]
[]
[]
[]
[]
[null,null,null,2,{"$f":"'Question bank'!C29","v":"There are opportunities for value adding to my products within the supply chain."}]
{"$rows_left_out":11}
{"sheet":"Product differentiation","index":12,"n_rows":30,"n_cols":5,"rows_kept":30,"cut":false,"hidden":true,"merged":[[29,3,31,3],[29,4,31,19],[29,20,31,21],[2,3,4,21],[9,3,11,3],[9,4,11,19],[9,20,11,21],[14,3,16,3],[14,4,16,19],[14,20,16,21],[19,3,21,3],[19,4,21,19],[19,20,21,21],[24,3,26,3],[24,4,26,19],[24,20,26,21]]}
[]
[]
[null,null,null,"Product differentiation"]
[]
[]
[null,null,null,"This refers to quality assurance, compliance to standards, certifcation (e.g., organic), branding, "]
[null,null,null,"marketing, and consumer education. An example of this is using agritech to value add to cherry waste and"]
[null,null,null,"converting waste cherries into food for sale. "]
[]
[null,null,null,1,{"$f":"'Question bank'!C23","v":"My product/enterprise is differentiated from my competitors in the market."}]
[]
[]
[]
[]
[null,null,null,2,{"$f":"'Question bank'!C24","v":"There is potential for further product differentiation in the market to boost my profitability."}]
{"$rows_left_out":16}
{"sheet":"Improving productivity","index":13,"n_rows":25,"n_cols":5,"rows_kept":25,"cut":false,"hidden":true,"merged":[[19,3,21,3],[19,4,21,19],[19,20,21,21],[24,3,26,3],[24,4,26,19],[24,20,26,21],[2,3,4,21],[9,3,11,3],[9,4,11,19],[9,20,11,21],[14,3,16,3],[14,4,16,19],[14,20,16,21]]}
[]
[]
[null,null,null,"Improving productivity"]
[]
[]
[null,null,null,"This refers to building knowledge, access to data and information. Also considers genetics, "]
[null,null,null,"agronomy, and adoption of new technology."]
[]
[]
[null,null,null,1,{"$f":"'Question bank'!C32","v":"I consistently meet the quality and quantity expectations of my customers. "}]
[]
[]
[]
[]
[null,null,null,2,{"$f":"'Question bank'!C33","v":"I can access the skills and information I need (e.g., agronomic advice) to optimise my productivity. "}]
{"$rows_left_out":11}
{"sheet":"Financial resilience","index":14,"n_rows":25,"n_cols":5,"rows_kept":25,"cut":false,"hidden":true,"merged":[[19,3,21,3],[19,4,21,19],[19,20,21,21],[24,3,26,3],[24,4,26,19],[24,20,26,21],[2,3,4,21],[9,3,11,3],[9,4,11,19],[9,20,11,21],[14,3,16,3],[14,4,16,19],[14,20,16,21]]}
[]
[]
[null,null,null,"Financial resilience"]
[]
[]
[null,null,null,"This refers to availability of cash reserves, management of debt/equity, adequate financial planning, "]
[null,null,null,"utilisation of financial tools e.g., forward contracts, regulatory compliance, and insurance. "]
[]
[]
[null,null,null,1,{"$f":"'Question bank'!C36","v":"I have an understanding of financial management and financial products."}]
[]
[]
[]
[]
[null,null,null,2,{"$f":"'Question bank'!C37","v":"I have a clear financial plan for my business moving forward."}]
{"$rows_left_out":11}
{"sheet":"Building networks","index":15,"n_rows":30,"n_cols":5,"rows_kept":30,"cut":false,"hidden":true,"merged":[[29,3,31,3],[29,4,31,19],[29,20,31,21],[19,3,21,3],[19,4,21,19],[19,20,21,21],[24,3,26,3],[24,4,26,19],[24,20,26,21],[2,3,4,21],[9,3,11,3],[9,4,11,19],[9,20,11,21],[14,3,16,3],[14,4,16,19],[14,20,16,21]]}
[]
[]
[null,null,null,"Building networks"]
[]
[]
[null,null,null,"This refers to the strength of relationships with other aspects of the supply chain which leads to information exchange "]
[null,null,null,"within industry and industry leadership and cohesion. "]
[]
[]
[null,null,null,1,{"$f":"'Question bank'!C40","v":"I participate in an industry organisation such as advocacy groups, RDCs, local grower associations. (inclusive of local, state, and national levels)."}]
[]
[]
[]
[]
[null,null,null,2,{"$f":"'Question bank'!C41","v":"I have access to and participate in events, seminars, networking opportunties to learn more where I can. "}]
{"$rows_left_out":16}
{"sheet":"Diversification","index":16,"n_rows":30,"n_cols":5,"rows_kept":30,"cut":false,"hidden":true,"merged":[[24,3,26,3],[24,4,26,19],[24,20,26,21],[29,3,31,3],[29,4,31,19],[29,20,31,21],[2,3,4,21],[9,3,11,3],[9,4,11,19],[9,20,11,21],[19,3,21,3],[19,4,21,19],[19,20,21,21],[14,20,16,21],[14,3,16,3],[14,4,16,19]]}
[]
[]
[null,null,null,"Diversification"]
[]
[]
[null,null,null,"This refers to diversification of crops, animals, output differentiation (e.g., expanding into the sale of processed goods), and "]
[null,null,null,"diversifying landholdings. "]
[]
[]
[null,null,null,1,{"$f":"'Question bank'!C45","v":"I am able to change my land use for an alternative revenue generating purpose if my main farm or commodity become less financially viable. "}]
[]
[]
[]
[]
[null,null,null,2,{"$f":"'Question bank'!C46","v":"I have more than one income-generating activity on my farm."}]
{"$rows_left_out":15}